Ubuntu 9.10(32bit)

  • ページ: 動作報告
  • 投稿者: anonymous?
  • 状態: 失敗
  • ptexliveバージョン:20100304
  • 投稿日: 2010-03-06 (土) 11:57:11

必要パッケージ

ptexlive.cfg

ptexlive.cfg への変更は texlive2009-20091107.iso のマウントポイントだけです。

コンパイルが止まる直前のログ


Making all in .
make[7]: Entering directory `/var/tmp/ptexlive2009/texlive-20091011-source/Work/texk/web2c'
if [ -r ./tangle ] || [ -r ./tangle.exe ]; then \
	  WEBINPUTS=.:../../../texk/web2c TEXMFCNF=../../../texk/web2c/../kpathsea ./tangle tangle tangle; \
	  mv tangle.p tangleboot.p; \
	elif [ -r tangleboot.p ]; then \
	  touch tangleboot.p; \
	else \
	  cp ../../../texk/web2c/tangleboot.p .; \
	fi
date >stamp-tangle
make  tangle
make[8]: Entering directory `/var/tmp/ptexlive2009/texlive-20091011-source/Work/texk/web2c'
srcdir=../../../texk/web2c /bin/sh ../../../texk/web2c/web2c/convert tangleboot
gcc -DHAVE_CONFIG_H -I. -I../../../texk/web2c -I./.. -I/var/tmp/ptexlive2009/texlive-20091011-source/Work/texk -I/var/tmp/ptexlive2009/texlive-20091011-source/texk    -g -O2 -MT tangleboot.o -MD -MP -MF .deps/tangleboot.Tpo -c -o tangleboot.o tangleboot.c
mv -f .deps/tangleboot.Tpo .deps/tangleboot.Po
/bin/sh ./libtool --tag=CC   --mode=link gcc  -g -O2   -o tangleboot tangleboot.o lib/lib.a /var/tmp/ptexlive2009/texlive-20091011-source/Work/texk/kpathsea/libkpathsea.la -lm 
eval: 1: libtool_args+=: not found
eval: 1: compile_command+=: not found
eval: 1: finalize_command+=: not found
eval: 1: libtool_args+=: not found
eval: 1: compile_command+=: not found
eval: 1: finalize_command+=: not found
eval: 1: libtool_args+=: not found
eval: 1: compile_command+=: not found
eval: 1: finalize_command+=: not found
eval: 1: libtool_args+=: not found
eval: 1: compile_command+=: not found
eval: 1: finalize_command+=: not found
eval: 1: libtool_args+=: not found
eval: 1: compile_command+=: not found
eval: 1: finalize_command+=: not found
eval: 1: libtool_args+=: not found
eval: 1: libtool_args+=: not found
eval: 1: libtool_args+=: not found
libtool: link: gcc  lib/lib.a /var/tmp/ptexlive2009/texlive-20091011-source/Work/texk/kpathsea/.libs/libkpathsea.a -lm
lib/lib.a(main.o): In function `main':
/var/tmp/ptexlive2009/texlive-20091011-source/Work/texk/web2c/lib/../../../../texk/web2c/lib/main.c:26: undefined reference to `mainbody'
collect2: ld returned 1 exit status
make[8]: *** [tangleboot] Error 1
make[8]: Leaving directory `/var/tmp/ptexlive2009/texlive-20091011-source/Work/texk/web2c'
make[7]: *** [tangleboot.p] Error 2
make[7]: Leaving directory `/var/tmp/ptexlive2009/texlive-20091011-source/Work/texk/web2c'
make[6]: *** [all-recursive] Error 1
make[6]: Leaving directory `/var/tmp/ptexlive2009/texlive-20091011-source/Work/texk/web2c'
make[5]: *** [all] Error 2
make[5]: Leaving directory `/var/tmp/ptexlive2009/texlive-20091011-source/Work/texk/web2c'
make[4]: *** [subtexk] Error 1
make[4]: Leaving directory `/var/tmp/ptexlive2009/texlive-20091011-source/Work/texk'
make[3]: *** [all-recursive] Error 1
make[3]: Leaving directory `/var/tmp/ptexlive2009/texlive-20091011-source/Work/texk'
make[2]: *** [all-recursive] Error 1
make[2]: Leaving directory `/var/tmp/ptexlive2009/texlive-20091011-source/Work'
Command exited with non-zero status 2
124.68user 37.64system 3:22.01elapsed 80%CPU (0avgtext+0avgdata 0maxresident)k
240inputs+192760outputs (4major+9328661minor)pagefaults 0swaps
+ echo 2
find: `/var/tmp/ptexlive2009/texlive-20091011-source/inst/bin': No such file or directory
./Build: Build failed, no executables under /var/tmp/ptexlive2009/texlive-20091011-source/inst/bin.
done Sat Mar 6 11:47:30 JST 2010
make[1]: *** [stage3] エラー 2

メッセージ

コンパイルの途中で止まってしまいました。 どこにどういう問題があるのか皆目わかりません。 よろしくお願いします。


  • すいません、まったく原因を思いつきません。ptex 拡張抜きに source.tar.xz を展開して ./Build しても失敗すると思うのですが、もし本当にそうなら環境バグの可能性も否定できないことになります。 -- 土村 2010-03-07 (日) 01:51:09
  • 同じくUbuntu 9.10でptexliveを使わせていただいております。初心者なので詳しいことは分からないのですが、 export CONFIG_SHELL=/bin/bash を実行してからコンパイルに成功しました。-- 2010-03-07 (日) 11:42:38
  • そう言えば CONFIG_SHELL の指摘は ptetexWiki:動作報告/127 でもいただいていたことを思い出しました。同じ対策をしておきます。 -- 土村 2010-03-07 (日) 18:00:58
  • 土村さま、早速のご対処ありがとうございます。ptexlive-20100308で make しましたところ、無事にコンパイルでき、動作しております。 -- 報告者です 2010-03-09 (火) 10:41:52
  • 実は直後に Vine4.2 で副作用が出てしまうことがわかったので、export CONFIG_SHELL=/bin/bash は ptexlive.cfg に書いてもらうことにするかもしれません。 -- 土村 2010-03-10 (水) 11:27:11


トップ   編集 凍結 差分 バックアップ 添付 複製 名前変更 リロード   新規 一覧 単語検索 最終更新   ヘルプ   最終更新のRSS
Last-modified: 2010-03-10 (水) 11:27:12 (3296d)