Fedora Core 6

  • ページ: 動作報告
  • 投稿者: anonymous?
  • 状態: 成功
  • ptetexバージョン:20071017
  • 投稿日: 2007-10-20 (土) 17:07:26

必要パッケージ

(Fedora Core 6 のインストールをどんな設定で行ったかは不明で,加えて) libXt-devel, libXaw-devel が必要.

my_option

[reading]    ../my_option
conf_option --with-system-zlib
conf_option --with-system-pnglib
conf_option --with-system-gd
conf_option --with-system-ncurses
conf_option --with-system-t1lib
conf_option --without-dviljk
conf_option --without-info
conf_option --without-texi2html
conf_option --without-texinfo
JAPANESE=international
KANJI_CODE=UTF8
XDVI=echo
PXDVI=echo

メッセージ

libXt-devel, libXaw-devel を追加インストールしないと,以下のエラーが出て失敗した.

gmake[5]: ディレクトリ `/var/tmp/ptetex3/tetex-src-3.0/texk/pxdvik/gui' に入ります
gcc -DHAVE_CONFIG_H  -I. -I. -I../.. -I../.. -W -Wall -Wunused -I.. -I./..  -DPS_GS  -DXSERVER_INFO  -g -O2  -c help-window.c -o help-window.o
help-window.c:29 から include されたファイル中:
../xdvi.h:158:27: error: X11/Intrinsic.h: そのようなファイルやディレクトリはありません
In file included from help-window.c:29:
../xdvi.h:452: error: expected specifier-qualifier-list before ‘Boolean’
../xdvi.h:638: error: expected ‘)’ before ‘also_pixels’
../xdvi.h:665: error: expected specifier-qualifier-list before ‘Boolean’
../xdvi.h:680: error: expected specifier-qualifier-list before ‘Boolean’
../xdvi.h:724: error: expected specifier-qualifier-list before ‘Widget’
../xdvi.h:750: error: expected specifier-qualifier-list before ‘XtAppContext’
../xdvi.h:817: error: expected ‘=’, ‘,’, ‘;’, ‘asm’ or ‘__attribute__’ before ‘app’
../xdvi.h:827: error: expected ‘=’, ‘,’, ‘;’, ‘asm’ or ‘__attribute__’ before ‘G_accels_cr’
../xdvi.h:858: error: expected ‘=’, ‘,’, ‘;’, ‘asm’ or ‘__attribute__’ before ‘have_src_specials’
../xdvi.h:860: error: expected ‘=’, ‘,’, ‘;’, ‘asm’ or ‘__attribute__’ before ‘dragcurs’
../xdvi.h:868: error: expected ‘=’, ‘,’, ‘;’, ‘asm’ or ‘__attribute__’ before ‘plane_masks’
../xdvi.h:919: error: expected specifier-qualifier-list before ‘Boolean’
../xdvi.h:926: error: expected specifier-qualifier-list before ‘Boolean’
../xdvi.h:942: error: expected ‘=’, ‘,’, ‘;’, ‘asm’ or ‘__attribute__’ before ‘*’ token
../xdvi.h:947: error: expected ‘=’, ‘,’, ‘;’, ‘asm’ or ‘__attribute__’ before ‘color_warned’
../xdvi.h:950: error: expected ‘=’, ‘,’, ‘;’, ‘asm’ or ‘__attribute__’ before ‘dvi_file_corrupted’
../xdvi.h:968: error: expected ‘=’, ‘,’, ‘;’, ‘asm’ or ‘__attribute__’ before ‘gs_postpone_prescan’
../xdvi.h:984: error: expected ‘=’, ‘,’, ‘;’, ‘asm’ or ‘__attribute__’ before ‘drawing_mag’
../xdvi.h:985: error: expected ‘=’, ‘,’, ‘;’, ‘asm’ or ‘__attribute__’ before ‘htex_inside_href’
../xdvi.h:999: error: expected ‘=’, ‘,’, ‘;’, ‘asm’ or ‘__attribute__’ before ‘psfig_begun’
../xdvi.h:1003: error: expected ‘=’, ‘,’, ‘;’, ‘asm’ or ‘__attribute__’ before ‘ignore_papersize_specials’
../xdvi.h:1004: error: expected ‘=’, ‘,’, ‘;’, ‘asm’ or ‘__attribute__’ before ‘have_raw_postscript’
../xdvi.h:1008: error: expected ‘=’, ‘,’, ‘;’, ‘asm’ or ‘__attribute__’ before ‘had_ps_specials’
../xdvi.h:1023: error: expected ‘=’, ‘,’, ‘;’, ‘asm’ or ‘__attribute__’ before ‘statusline’
../xdvi.h:1089: error: expected ‘)’ before ‘fullsize’
../xdvi.h:1091: error: expected ‘)’ before ‘*’ token
help-window.c:34:28: error: X11/StringDefs.h: そのようなファイルやディレクトリはありません
help-window.c:43:28: error: X11/Xaw/Paned.h: そのようなファイルやディレクトリはありません
help-window.c:44:27: error: X11/Xaw/Form.h: そのようなファイルやディレクトリはありません
help-window.c:45:32: error: X11/Xaw/AsciiText.h: そのようなファイルやディレクトリはありません
In file included from help-window.c:52:
message-window.h:35: error: expected ‘)’ before ‘w’
message-window.h:40: error: expected ‘)’ before ‘arg’
message-window.h:47: error: expected ‘=’, ‘,’, ‘;’, ‘asm’ or ‘__attribute__’ before ‘popup_message’
message-window.h:52: error: expected ‘=’, ‘,’, ‘;’, ‘asm’ or ‘__attribute__’ before ‘popup_message_sized’
message-window.h:58: error: expected ‘=’, ‘,’, ‘;’, ‘asm’ or ‘__attribute__’ before ‘positioned_popup_message’
message-window.h:63: error: expected ‘=’, ‘,’, ‘;’, ‘asm’ or ‘__attribute__’ before ‘choice_dialog’
message-window.h:86: error: expected ‘=’, ‘,’, ‘;’, ‘asm’ or ‘__attribute__’ before ‘choice_dialog_sized’
message-window.h:98: error: expected ‘=’, ‘,’, ‘;’, ‘asm’ or ‘__attribute__’ before ‘positioned_choice_dialog’
message-window.h:110: error: expected ‘=’, ‘,’, ‘;’, ‘asm’ or ‘__attribute__’ before ‘raise_message_windows’
message-window.h:111: error: expected ‘=’, ‘,’, ‘;’, ‘asm’ or ‘__attribute__’ before ‘is_message_window’
message-window.h:112: error: expected ‘=’, ‘,’, ‘;’, ‘asm’ or ‘__attribute__’ before ‘kill_message_window’
In file included from ../util.h:49,
                 from help-window.c:53:
../events.h:90: error: expected specifier-qualifier-list before ‘Boolean’
../events.h:117: error: expected specifier-qualifier-list before ‘XtTimerCallbackProc’
../events.h:126: error: expected ‘=’, ‘,’, ‘;’, ‘asm’ or ‘__attribute__’ before ‘*’ token
../events.h:128: error: expected declaration specifiers or ‘...’ before ‘Boolean’
../events.h:130: error: expected declaration specifiers or ‘...’ before ‘Boolean’
../events.h:131: error: expected ‘=’, ‘,’, ‘;’, ‘asm’ or ‘__attribute__’ before ‘get_int_arg’
../events.h:132: error: expected ‘=’, ‘,’, ‘;’, ‘asm’ or ‘__attribute__’ before ‘toggle_arg’
../events.h:139: error: expected ‘)’ before ‘bar’
../events.h:143: error: expected ‘)’ before ‘XEvent’
../events.h:144: error: expected ‘)’ before ‘XEvent’
../events.h:145: error: expected ‘)’ before ‘XEvent’
../events.h:146: error: expected ‘)’ before ‘widget’
../events.h:156: error: expected declaration specifiers or ‘...’ before ‘Boolean’
../events.h:159: error: expected ‘)’ before ‘early’
../events.h:162: error: expected declaration specifiers or ‘...’ before ‘Boolean’
../events.h:162: error: expected declaration specifiers or ‘...’ before ‘Boolean’
../events.h:163: error: expected ‘)’ before ‘update_resource’
../events.h:166: error: expected ‘)’ before ‘w’
../events.h:170: error: expected ‘)’ before ‘w’
../events.h:173: error: expected ‘)’ before ‘w’
../events.h:174: error: expected ‘)’ before ‘w’
../events.h:175: error: expected ‘)’ before ‘w’
../events.h:177: error: expected ‘)’ before ‘w’
../events.h:178: error: expected ‘)’ before ‘w’
../events.h:179: error: expected ‘)’ before ‘w’
../events.h:180: error: expected declaration specifiers or ‘...’ before ‘Boolean’
../events.h:181: error: expected ‘)’ before ‘w’
../events.h:182: error: expected ‘)’ before ‘w’
../events.h:183: error: expected ‘)’ before ‘w’
../events.h:184: error: expected ‘)’ before ‘w’
../events.h:185: error: expected ‘)’ before ‘w’
../events.h:186: error: expected ‘)’ before ‘w’
../events.h:187: error: expected ‘)’ before ‘w’
../events.h:194: error: expected ‘)’ before ‘w’
../events.h:195: error: expected ‘)’ before ‘w’
../events.h:196: error: expected ‘)’ before ‘w’
../events.h:197: error: expected ‘)’ before ‘w’
../events.h:198: error: expected ‘)’ before ‘w’
../events.h:202: error: expected ‘=’, ‘,’, ‘;’, ‘asm’ or ‘__attribute__’ before ‘block_this_mouse_event’
../events.h:204: error: expected ‘=’, ‘,’, ‘;’, ‘asm’ or ‘__attribute__’ before ‘dragging_text_selection’
../events.h:215: error: expected ‘=’, ‘,’, ‘;’, ‘asm’ or ‘__attribute__’ before ‘check_resource_expert’
../events.h:216: error: expected ‘=’, ‘,’, ‘;’, ‘asm’ or ‘__attribute__’ before ‘check_paper_landscape’
../events.h:217: error: expected ‘=’, ‘,’, ‘;’, ‘asm’ or ‘__attribute__’ before ‘check_papersize’
../events.h:218: error: expected ‘=’, ‘,’, ‘;’, ‘asm’ or ‘__attribute__’ before ‘check_toggle’
../events.h:219: error: expected ‘=’, ‘,’, ‘;’, ‘asm’ or ‘__attribute__’ before ‘check_int’
../events.h:225: error: expected specifier-qualifier-list before ‘XtActionProc’
../events.h:232: error: expected ‘)’ before ‘client_data’
../events.h:235: error: expected ‘)’ before ‘w’
../events.h:236: error: expected ‘)’ before ‘w’
../events.h:237: error: expected ‘)’ before ‘w’
In file included from help-window.c:53:
../util.h:63: error: expected ‘=’, ‘,’, ‘;’, ‘asm’ or ‘__attribute__’ before ‘fork_process’
In file included from help-window.c:53:
../util.h:118: error: expected ‘=’, ‘,’, ‘;’, ‘asm’ or ‘__attribute__’ before ‘pointerlocate’
../util.h:143: error: expected ‘=’, ‘,’, ‘;’, ‘asm’ or ‘__attribute__’ before ‘find_str_int_hash’
../util.h:146: error: expected ‘=’, ‘,’, ‘;’, ‘asm’ or ‘__attribute__’ before ‘copy_file’
../util.h:147: error: expected ‘=’, ‘,’, ‘;’, ‘asm’ or ‘__attribute__’ before ‘copy_fp’
help-window.c:54 から include されたファイル中:
../x_util.h:28:23: error: X11/Shell.h: そのようなファイルやディレクトリはありません
In file included from help-window.c:54:
../x_util.h:39: error: expected ‘=’, ‘,’, ‘;’, ‘asm’ or ‘__attribute__’ before ‘do_autoscroll’
../x_util.h:42: error: expected ‘)’ before ‘w1’
../x_util.h:43: error: expected ‘)’ before ‘w’
../x_util.h:45: error: expected ‘)’ before ‘a’
../x_util.h:46: error: expected declaration specifiers or ‘...’ before ‘Pixel’
../x_util.h:46: error: expected declaration specifiers or ‘...’ before ‘Pixel’
../x_util.h:57: error: expected declaration specifiers or ‘...’ before ‘Boolean’
../x_util.h:103: error: expected declaration specifiers or ‘...’ before ‘Widget’
../x_util.h:113: error: expected ‘)’ before ‘w’
../x_util.h:114: error: expected ‘=’, ‘,’, ‘;’, ‘asm’ or ‘__attribute__’ before ‘get_matching_parent’
../x_util.h:115: error: expected ‘=’, ‘,’, ‘;’, ‘asm’ or ‘__attribute__’ before ‘widget_is_parent’
../x_util.h:117: error: expected ‘)’ before ‘w1’
../x_util.h:118: error: expected ‘)’ before ‘w1’
../x_util.h:119: error: expected ‘)’ before ‘w1’
../x_util.h:122: error: expected ‘)’ before ‘w’
../x_util.h:125: error: expected ‘)’ before ‘w’
../x_util.h:126: error: expected ‘=’, ‘,’, ‘;’, ‘asm’ or ‘__attribute__’ before ‘get_widget_by_name’
../x_util.h:128: error: expected ‘)’ before ‘db’
../x_util.h:130: error: expected ‘)’ before ‘*’ token
../x_util.h:131: error: expected ‘=’, ‘,’, ‘;’, ‘asm’ or ‘__attribute__’ before ‘save_user_preferences’
../x_util.h:132: error: expected ‘)’ before ‘toplevel’
../x_util.h:136: error: expected ‘)’ before ‘same_file’
../x_util.h:139: error: expected ‘=’, ‘,’, ‘;’, ‘asm’ or ‘__attribute__’ before ‘clip_region’
../x_util.h:140: error: expected ‘=’, ‘,’, ‘;’, ‘asm’ or ‘__attribute__’ before ‘clip_region_to_rect’
../x_util.h:142: error: expected ‘=’, ‘,’, ‘;’, ‘asm’ or ‘__attribute__’ before ‘window_is_mapped’
In file included from help-window.c:55:
../string-utils.h:8: error: expected ‘=’, ‘,’, ‘;’, ‘asm’ or ‘__attribute__’ before ‘str_is_prefix’
../string-utils.h:9: error: expected ‘=’, ‘,’, ‘;’, ‘asm’ or ‘__attribute__’ before ‘str_is_suffix’
../string-utils.h:10: error: expected ‘=’, ‘,’, ‘;’, ‘asm’ or ‘__attribute__’ before ‘is_spaces_only’
../string-utils.h:24: error: expected declaration specifiers or ‘...’ before ‘Boolean’
../string-utils.h:33: error: expected declaration specifiers or ‘...’ before ‘Boolean’
../string-utils.h:35: error: expected ‘=’, ‘,’, ‘;’, ‘asm’ or ‘__attribute__’ before ‘src_compare’
In file included from help-window.c:56:
topic-window.h:43: error: expected specifier-qualifier-list before ‘Widget’
topic-window.h:48: error: expected specifier-qualifier-list before ‘Widget’
topic-window.h:70: error: expected ‘=’, ‘,’, ‘;’, ‘asm’ or ‘__attribute__’ before ‘create_topic_window’
In file included from help-window.c:57:
help-window.h:27: error: expected ‘)’ before ‘parent’
help-window.c:79: error: expected ‘=’, ‘,’, ‘;’, ‘asm’ or ‘__attribute__’ before ‘create_help_text’
help-window.c: In function ‘get_title_and_summary’:
help-window.c:133: error: ‘struct program_globals’ has no member named ‘program_name’
help-window.c:143: error: ‘struct program_globals’ has no member named ‘debug’
help-window.c: トップレベル:
help-window.c:148: error: expected declaration specifiers or ‘...’ before ‘Dimension’
help-window.c: In function ‘init_item’:
help-window.c:152: error: ‘Widget’ undeclared (first use in this function)
help-window.c:152: error: (Each undeclared identifier is reported only once
help-window.c:152: error: for each function it appears in.)
help-window.c:152: error: expected ‘;’ before ‘help_form’
help-window.c:153: error: expected ‘;’ before ‘text’
help-window.c:154: error: ‘struct topic_info’ has no member named ‘items’
help-window.c:167: error: ‘struct program_globals’ has no member named ‘program_name’
help-window.c:203: error: ‘help_form’ undeclared (first use in this function)
help-window.c:203: 警告: implicit declaration of function ‘XtVaCreateManagedWidget’
help-window.c:211: error: ‘formWidgetClass’ undeclared (first use in this function)
help-window.c:211: error: ‘struct topic_info’ has no member named ‘right_form’
help-window.c:212: error: ‘XtNborderWidth’ undeclared (first use in this function)
help-window.c:213: error: ‘XtNdefaultDistance’ undeclared (first use in this function)
help-window.c:216: error: ‘struct topic_item’ has no member named ‘widget’
help-window.c:218: error: ‘text’ undeclared (first use in this function)
help-window.c:218: 警告: implicit declaration of function ‘create_help_text’
help-window.c:224: 警告: implicit declaration of function ‘XtOverrideTranslations’
help-window.c:224: 警告: implicit declaration of function ‘XtParseTranslationTable’
help-window.c:228: error: ‘Dimension’ undeclared (first use in this function)
help-window.c:228: error: expected ‘;’ before ‘w’
help-window.c:229: 警告: implicit declaration of function ‘XtVaGetValues’
help-window.c:229: error: ‘XtNwidth’ undeclared (first use in this function)
help-window.c:229: error: ‘w’ undeclared (first use in this function)
help-window.c:230: error: ‘width’ undeclared (first use in this function)
help-window.c: In function ‘initialize_items’:
help-window.c:242: error: ‘Dimension’ undeclared (first use in this function)
help-window.c:242: error: expected ‘;’ before ‘width’
help-window.c:1007: error: ‘width’ undeclared (first use in this function)
help-window.c:1009: error: ‘struct x_resources’ has no member named ‘help_general’
help-window.c:1009: error: too many arguments to function ‘init_item’
help-window.c:1010: error: ‘struct x_resources’ has no member named ‘help_pagemotion’
help-window.c:1010: error: too many arguments to function ‘init_item’
help-window.c:1011: error: ‘struct x_resources’ has no member named ‘help_othercommands’
help-window.c:1011: error: too many arguments to function ‘init_item’
help-window.c:1012: error: ‘struct x_resources’ has no member named ‘help_hypertex’
help-window.c:1012: error: too many arguments to function ‘init_item’
help-window.c:1013: error: ‘struct x_resources’ has no member named ‘help_mousebuttons’
help-window.c:1013: error: too many arguments to function ‘init_item’
help-window.c:1014: error: ‘struct x_resources’ has no member named ‘help_modes’
help-window.c:1014: error: too many arguments to function ‘init_item’
help-window.c:1015: error: ‘struct x_resources’ has no member named ‘help_search’
help-window.c:1015: error: too many arguments to function ‘init_item’
help-window.c:1016: error: ‘struct x_resources’ has no member named ‘help_pagemotion’
help-window.c:1016: error: too many arguments to function ‘init_item’
help-window.c:1017: error: ‘struct x_resources’ has no member named ‘help_sourcespecials’
help-window.c:1017: error: too many arguments to function ‘init_item’
help-window.c:1019: error: ‘struct program_globals’ has no member named ‘program_name’
help-window.c:1022: error: ‘struct topic_info’ has no member named ‘items’
help-window.c:1023: error: ‘struct topic_info’ has no member named ‘items’
help-window.c:1023: error: ‘struct topic_info’ has no member named ‘items’
help-window.c:1027: 警告: implicit declaration of function ‘XtVaSetValues’
help-window.c:1027: error: ‘struct topic_info’ has no member named ‘topic_label’
help-window.c:1027: error: ‘XtNwidth’ undeclared (first use in this function)
help-window.c: トップレベル:
help-window.c:1037: error: expected ‘)’ before ‘toplevel’
gmake[5]: *** [help-window.o] エラー 1
gmake[5]: ディレクトリ `/var/tmp/ptetex3/tetex-src-3.0/texk/pxdvik/gui' から出ます
gmake[4]: *** [libguibuild] エラー 2
gmake[4]: ディレクトリ `/var/tmp/ptetex3/tetex-src-3.0/texk/pxdvik' から出ます
gmake[3]: *** [all] エラー 1
gmake[3]: ディレクトリ `/var/tmp/ptetex3/tetex-src-3.0/texk' から出ます
gmake[2]: *** [all] エラー 1
gmake[2]: ディレクトリ `/var/tmp/ptetex3/tetex-src-3.0' から出ます
make[1]: *** [stage4] エラー 2

  • libXt-develとlibXaw-develをインストールしたら解決できました。 -- 2007-10-20 (土) 17:39:53


トップ   編集 凍結 差分 バックアップ 添付 複製 名前変更 リロード   新規 一覧 単語検索 最終更新   ヘルプ   最終更新のRSS
Last-modified: 2009-07-13 (月) 09:26:31 (3604d)