OpenBSD4.4 -stable(i386)

  • ページ: 動作報告
  • 投稿者: chocolat?
  • 状態: 完了
  • ptetexバージョン:20080616
  • 投稿日: 2009-01-29 (木) 17:06:17

必要パッケージ

mplus-ttf-20060520p0
bash-3.2.39

my_option

conf_option --with-system-zlib
conf_option --with-system-pnglib
conf_option --with-system-gd
conf_option --with-system-ncurses
conf_option --with-system-t1lib

conf_option --without-dviljk
conf_option --without-info
conf_option --without-texi2html
conf_option --without-texinfo

export CPPFLAGS="-I/usr/local/include -I/usr/sfw/include -I/opt/sfw/include -I/usr/openwin/include -I/usr/xenocara/lib/freetype/include"

SYSTEM_FREETYPE2=no
EXTRA_TRUETYPE="/usr/X11R6/lib/X11/fonts/TTF;/usr/local/lib/X11/fonts/mplus"

メッセージ

ノートパソコンVAIO VGN-TX91PS(SONY)上でインストールの動作報告です。Express5800Ge上でのインストールの動作報告は動作報告125で別途報告してあります。

デスクトップ環境にはXfceのみ構築していること以外はExpress5800Ge上でのインストールのときと同じく、その他は日本語フォントにはmplus-ttf、日本語入力にはuim-anthyを使用して、作業をおこないました。

my_optionに上記のオプションを設定後、bashで
make all3

すると以下のエラーメッセージが出ます。

In file included from builds/unix/ftconfig.h:42,
          from /usr/xenocara/lib/freetype/include/freetype/freetype.h:41,
          from /usr/xenocara/lib/freetype/include/freetype/ftmodapi.h:24,
          from /usr/xenocara/lib/freetype/include/freetype/ftrender.h:24,
          from /usr/xenocara/lib/freetype/include/freetype/internal/ftobjs.h:30,
          from /usr/xenocara/lib/freetype/include/freetype/internal/psaux.h:25,
          from /var/tmp/ptetex3/tetex-src-3.0/freetype/src/psaux/psobjs.c:20,
          from /var/tmp/ptetex3/tetex-src-3.0/freetype/src/psaux/psaux.c:22:
/usr/xenocara/lib/freetype/include/freetype/config/ftoption.h:166:1: warning: "FT_CONFIG_OPTION_SYSTEM_ZLIB" redefined
<command line>:4:1: warning: this is the location of the previous definition
In file included from /var/tmp/ptetex3/tetex-src-3.0/freetype/src/psaux/psaux.c:22:
/var/tmp/ptetex3/tetex-src-3.0/freetype/src/psaux/psobjs.c: In function `t1_builder_init':
/var/tmp/ptetex3/tetex-src-3.0/freetype/src/psaux/psobjs.c:1488: error: structure has no member named `scale_x'
/var/tmp/ptetex3/tetex-src-3.0/freetype/src/psaux/psobjs.c:1489: error: structure has no member named `scale_y'
gmake: *** [/var/tmp/ptetex3/tetex-src-3.0/freetype/objs/psaux.lo] Error 1
*** Error code 2~ [#vc7b15b9]
Stop in テフのディレクトリ/ptetex3-20080616 (line 66 of Makefile).;

現在何がエラーの元となっているのか探しています。




問題が解決致しました。
動作報告126のと全く方法でインストール完了しました。

ただし、
日本語環境、デスクトップ環境はExpress5800Geとほぼ同じものを構築し直しました。
しかしgnome-panelの調子がおかしいのでVaioではgnomeに加え、kdeも構築しています。
作業はgnomeを起動した状態でgnometerminalでおこないました。
また、/varに600MBしか割り当てていないので、動作報告125のmy_optionにさらに

TMP_PREFIX=/home/USERNAME/Desktop/texbuild

を指定しました。

みなさんの参考になればうれしいでです。



トップ   編集 凍結 差分 バックアップ 添付 複製 名前変更 リロード   新規 一覧 単語検索 最終更新   ヘルプ   最終更新のRSS
Last-modified: 2010-04-08 (木) 22:40:00 (2751d)